Target
POsterior Segregation
Ligand
BDBM52469
Substrate
Meas. Tech.
Fluorescent Polarization Homogeneous Dose Response HTS to Indentify Inhibitors of POS-1 Binding to mex-3-RNA
EC50
108274±n/a nM
Citation
 PubChem, PC Fluorescent Polarization Homogeneous Dose Response HTS to Indentify Inhibitors of POS-1 Binding to mex-3-RNA PubChem Bioassay (2009)[AID] 
Target
Name:
POsterior Segregation
Synonyms:
POsterior Segregation family member (pos-1)
Type:
Enzyme Catalytic Domain
Mol. Mass.:
29838.90
Organism:
Caenorhabditis elegans
Description:
gi_17562800
Residue:
264
  
Inhibitor
Name:
BDBM52469
Synonyms:
(6Z)-5-azanylidene-6-[[1-[3-(3-methoxyphenoxy)propyl]indol-3-yl]methylidene]-2-methyl-[1,3]thiazolo[3,2-a]pyrimidin-7-one (6Z)-5-imino-6-[[1-[3-(3-methoxyphenoxy)propyl]indol-3-yl]methylene]-2-methyl-thiazolo[3,2-a]pyrimidin-7-one 5-Imino-6-[1-{1-[3-(3-methoxy-phenoxy)-propyl]-1H-indol-3-yl}-meth-(Z)-ylidene]-2-methyl-5,6-dihydro-thiazolo[3,2-a]pyrimidin-7-one SMR000220732 | cid_6516390
Type:
Small organic molecule
Emp. Form.:
C26H24N4O3S
Mol. Mass.:
472.559
SMILES:
COc1cccc(OCCCn2cc(\C=C3/C(=O)N=C4SC(C)=CN4C3=N)c3ccccc23)c1
: