Target
POsterior Segregation
Ligand
BDBM47981
Substrate
Meas. Tech.
Fluorescent Polarization Homogeneous Dose Response HTS to Indentify Inhibitors of POS-1 Binding to mex-3-RNA
EC50
43567±n/a nM
Citation
 PubChem, PC Fluorescent Polarization Homogeneous Dose Response HTS to Indentify Inhibitors of POS-1 Binding to mex-3-RNA PubChem Bioassay (2009)[AID] 
Target
Name:
POsterior Segregation
Synonyms:
POsterior Segregation family member (pos-1)
Type:
Enzyme Catalytic Domain
Mol. Mass.:
29838.90
Organism:
Caenorhabditis elegans
Description:
gi_17562800
Residue:
264
  
Inhibitor
Name:
BDBM47981
Synonyms:
4-(5-Formyl-furan-2-yl)-benzoic acid ethyl ester 4-(5-formyl-2-furyl)benzoic acid ethyl ester SMR000436185 ethyl 4-(5-formylfuran-2-yl)benzoate | ethyl 4-(5-methanoylfuran-2-yl)benzoate
Type:
Small organic molecule
Emp. Form.:
C14H12O4
Mol. Mass.:
244.2427
SMILES:
CCOC(=O)c1ccc(cc1)-c1ccc(C=O)o1
: