Target
Nucleotide-binding oligomerization domain-containing protein 2
Ligand
BDBM54510
Substrate
Meas. Tech.
uHTS luminescence assay for the identification of compounds that inhibit NOD2 in MDP treated cells
IC50
8241±n/a nM
Citation
 PubChem, PC uHTS luminescence assay for the identification of compounds that inhibit NOD2 in MDP treated cells PubChem Bioassay (2010)[AID] 
Target
Name:
Nucleotide-binding oligomerization domain-containing protein 2
Synonyms:
CARD15 IBD1 NOD2 Nucleotide-binding oligomerization domain-containing protein 2 | nucleotide-binding oligomerization domain containing 2
Type:
PROTEIN
Mol. Mass.:
115287.18
Organism:
Homo sapiens (Human)
Description:
ChEMBL_1454053
Residue:
1040
  
Inhibitor
Name:
BDBM54510
Synonyms:
5-chloranyl-N-[4-[ethyl(phenyl)sulfamoyl]phenyl]-2-methylsulfonyl-pyrimidine-4-carboxamide 5-chloro-N-[4-[ethyl(phenyl)sulfamoyl]phenyl]-2-methylsulfonyl-4-pyrimidinecarboxamide MLS001116357 cid_16012863
Type:
Small organic molecule
Emp. Form.:
C20H19ClN4O5S2
Mol. Mass.:
494.972
SMILES:
CCN(c1ccccc1)S(=O)(=O)c1ccc(NC(=O)c2nc(ncc2Cl)S(C)(=O)=O)cc1
: