Target
SUMO-conjugating enzyme UBC9
Ligand
BDBM61215
Substrate
Meas. Tech.
AlphaScreen confirmatory assay for validation of inhibitors of SUMOylation
IC50
5040±n/a nM
Citation
 PubChem, PC AlphaScreen confirmatory assay for validation of inhibitors of SUMOylation PubChem Bioassay (2010)[AID] 
Target
Name:
SUMO-conjugating enzyme UBC9
Synonyms:
UBC9 UBCE9 ubiquitin-conjugating enzyme E2I
Type:
Enzyme Catalytic Domain
Mol. Mass.:
18011.66
Organism:
Homo sapiens (Human)
Description:
gi_4507785
Residue:
158
  
Inhibitor
Name:
BDBM61215
Synonyms:
(5-amino-1-naphthalenyl)arsonic acid (5-aminonaphthalen-1-yl)arsonic acid MLS000737441 cid_224922
Type:
Small organic molecule
Emp. Form.:
C10H10AsNO3
Mol. Mass.:
267.1129
SMILES:
Nc1cccc2c(cccc12)[As](O)(O)=O
: