Target
Cell division control protein 42 homolog
Ligand
BDBM54619
Substrate
Meas. Tech.
Pyrazoline SAR compounds tested via Multiplex dose response to identify specific small molecule inhibitors of Ras and Ras-related GTPases specifically Cdc42 activated mutant
EC50
30000±n/a nM
Citation
 PubChem, PC Pyrazoline SAR compounds tested via Multiplex dose response to identify specific small molecule inhibitors of Ras and Ras-related GTPases specifically Cdc42 activated mutant PubChem Bioassay (2009)[AID] 
Target
Name:
Cell division control protein 42 homolog
Synonyms:
CDC42 Cell division control protein 42 homolog cell division cycle 42 (GTP binding protein, 25kDa)
Type:
PROTEIN
Mol. Mass.:
21258.36
Organism:
Homo sapiens (Human)
Description:
ChEMBL_652970
Residue:
191
  
Inhibitor
Name:
BDBM54619
Synonyms:
3-(4-chlorophenyl)-5-(3,4-dimethoxyphenyl)-1-phenyl-2-pyrazoline UNM-0000305858 | cid_2883031
Type:
Small organic molecule
Emp. Form.:
C23H21ClN2O2
Mol. Mass.:
392.878
SMILES:
COc1ccc(cc1OC)C1CC(=NN1c1ccccc1)c1ccc(Cl)cc1
: