Target
Gag-Pol polyprotein [588-1027]/[588-1147]
Ligand
BDBM2129
Substrate
(rC)n.(dG)12-18
Meas. Tech.
HIV-1 RT Assay
IC50
5±n/a nM
Citation
 Cantrell, ASEngelhardt, PHogberg, MJaskunas, SRJohansson, NGJordan, CLKangasmetsa, JKinnick, MDLind, PMorin, JMMuesing, MANoreen, ROberg, BPranc, PSahlberg, CTernansky, RJVasileff, RTVrang, LWest, SJZhang, H Phenethylthiazolylthiourea (PETT) compounds as a new class of HIV-1 reverse transcriptase inhibitors. 2. Synthesis and further structure-activity relationship studies of PETT analogs. J Med Chem 39:4261-74 (1996)  
Target
Name:
Gag-Pol polyprotein [588-1027]/[588-1147]
Synonyms:
EC: 2.7.7.49 | HIV-1 Reverse Transcriptase
Type:
Protein Complex
Mol. Mass.:
115684
Description:
Components:
This complex has 2 components.
Component 1
Name:
Gag-Pol polyprotein [588-1147]
Synonyms:
HIV-1 Reverse Transcriptase Chain A gag-pol
Type:
Enzyme Subunit
Mol. Mass.:
64486.41
Organism:
Human immunodeficiency virus type 1
Description:
P04585[588-1147]
Residue:
560
  
Component 2
Name:
Gag-Pol polyprotein [588-1027]
Synonyms:
HIV-1 Reverse Transcriptase Chain B gag-pol
Type:
Enzyme Subunit
Mol. Mass.:
51337.13
Organism:
Human immunodeficiency virus type 1
Description:
P04585[588-1027]
Residue:
440
  
Inhibitor
Name:
BDBM2129
Synonyms:
1-(4-chloro-1,2-dihydropyridazin-1-yl)-3-[2-(2-chloro-3-ethoxy-6-fluorophenyl)ethyl]thiourea N-[2-(2-Chloro-3-ethoxy-6-fluorophenethyl)]-N-[2-(5-chloropyridazyl)]thiourea | PETT deriv.
Type:
Small organic molecule
Emp. Form.:
C15H17Cl2FN4OS
Mol. Mass.:
391.291
SMILES:
CCOc1ccc(F)c(CCNC(=S)NN2C=CC(Cl)C=N2)c1Cl
:
Substrate
Name:
(rC)n.(dG)12-18
Synonyms:
Type:
RNA-DNA duplex
Mol. Mass.:
358.43
Organism:
Description:
The incorporation of Tritium-labeled dGTP onto a poly(rC):oligo(dG)template:primer.
Residue:
3
NA