Target
Cell division control protein 42 homolog
Ligand
BDBM54686
Substrate
Meas. Tech.
Additional SAR compounds tested via Multiplex dose response to identify specific small molecule inhibitors of Ras and Ras-related GTPases specifically Cdc42 wildtype
Ki
2370±n/a nM
Citation
 PubChem, PC Additional SAR compounds tested via Multiplex dose response to identify specific small molecule inhibitors of Ras and Ras-related GTPases specifically Cdc42 wildtype PubChem Bioassay (2009)[AID] 
Target
Name:
Cell division control protein 42 homolog
Synonyms:
CDC42 Cell division control protein 42 homolog cell division cycle 42 (GTP binding protein, 25kDa)
Type:
PROTEIN
Mol. Mass.:
21258.36
Organism:
Homo sapiens (Human)
Description:
ChEMBL_652970
Residue:
191
  
Inhibitor
Name:
BDBM54686
Synonyms:
2-amino-5-benzoyl-4-(3-bromo-4-methoxy-phenyl)-1-mesyl-pyrrole-3-carbonitrile 2-amino-5-benzoyl-4-(3-bromo-4-methoxyphenyl)-1-methylsulfonylpyrrole-3-carbonitrile UNM-0000305776 | cid_25220927
Type:
Small organic molecule
Emp. Form.:
C20H16BrN3O4S
Mol. Mass.:
474.328
SMILES:
COc1ccc(cc1Br)-c1c(C#N)c(N)n(c1C(=O)c1ccccc1)S(C)(=O)=O
: