Target
Ras-related protein Rab-7a
Ligand
BDBM54694
Substrate
Meas. Tech.
Additional SAR compounds tested via Multiplex dose response to identify specific small molecule inhibitors of Ras and Ras-related GTPases specifically Rab7 wildtype
EC50
30000±n/a nM
Citation
 PubChem, PC Additional SAR compounds tested via Multiplex dose response to identify specific small molecule inhibitors of Ras and Ras-related GTPases specifically Rab7 wildtype PubChem Bioassay (2009)[AID] 
Target
Name:
Ras-related protein Rab-7a
Synonyms:
GTP-binding protein (rab7) RAB7A | RAB7A_CANLF
Type:
Enzyme Catalytic Domain
Mol. Mass.:
23519.50
Organism:
Canis lupus familiaris
Description:
gi_164058
Residue:
207
  
Inhibitor
Name:
BDBM54694
Synonyms:
1-(2-nitrophenyl)-3-phenyl-2-propyn-1-one 1-(2-nitrophenyl)-3-phenylprop-2-yn-1-one cid_25227393
Type:
Small organic molecule
Emp. Form.:
C15H9NO3
Mol. Mass.:
251.2369
SMILES:
[O-][N+](=O)c1ccccc1C(=O)C#Cc1ccccc1
: