Target
GTPase KRas [1-37]
Ligand
BDBM50218896
Substrate
Meas. Tech.
Additional SAR compounds tested via Multiplex dose response to identify specific small molecule inhibitors of Ras and Ras-related GTPases specifically Ras activated mutant
EC50
30000±n/a nM
Comments
Extracted from aid = 2043 and tid = 2
Citation
 PubChem, PC Additional SAR compounds tested via Multiplex dose response to identify specific small molecule inhibitors of Ras and Ras-related GTPases specifically Ras activated mutant PubChem Bioassay (2009)[AID] 
Target
Name:
GTPase KRas [1-37]
Synonyms:
ras protein
Type:
Enzyme Catalytic Domain
Mol. Mass.:
4034.04
Organism:
Homo sapiens (Human)
Description:
gi_190938
Residue:
37
  
Inhibitor
Name:
BDBM50218896
Synonyms:
7-fluoroindirubin cid_11847138
Type:
Small organic molecule
Emp. Form.:
C16H9FN2O2
Mol. Mass.:
280.2533
SMILES:
Fc1cccc2C(C(=O)Nc12)=C1Nc2ccccc2C1=O
: