Target
GTPase KRas [1-37]
Ligand
BDBM54684
Substrate
Meas. Tech.
Additional SAR compounds tested via Multiplex dose response to identify specific small molecule inhibitors of Ras and Ras-related GTPases specifically Ras activated mutant
EC50
30000±n/a nM
Comments
Extracted from aid = 2043 and tid = 2
Citation
 PubChem, PC Additional SAR compounds tested via Multiplex dose response to identify specific small molecule inhibitors of Ras and Ras-related GTPases specifically Ras activated mutant PubChem Bioassay (2009)[AID] 
Target
Name:
GTPase KRas [1-37]
Synonyms:
ras protein
Type:
Enzyme Catalytic Domain
Mol. Mass.:
4034.04
Organism:
Homo sapiens (Human)
Description:
gi_190938
Residue:
37
  
Inhibitor
Name:
BDBM54684
Synonyms:
7-chloranyl-3-[3-(oxidanylamino)-1H-indol-2-yl]indol-2-one 7-chloro-3-[3-(hydroxyamino)-1H-indol-2-yl]indol-2-one cid_11845976
Type:
Small organic molecule
Emp. Form.:
C16H10ClN3O2
Mol. Mass.:
311.723
SMILES:
ONc1c([nH]c2ccccc12)C1=c2cccc(Cl)c2=NC1=O
: