Target
GTPase KRas [1-37]
Ligand
BDBM54697
Substrate
Meas. Tech.
Additional SAR compounds tested via Multiplex dose response to identify specific small molecule inhibitors of Ras and Ras-related GTPases specifically Ras activated mutant
EC50
30000±n/a nM
Comments
Extracted from aid = 2043 and tid = 2
Citation
 PubChem, PC Additional SAR compounds tested via Multiplex dose response to identify specific small molecule inhibitors of Ras and Ras-related GTPases specifically Ras activated mutant PubChem Bioassay (2009)[AID] 
Target
Name:
GTPase KRas [1-37]
Synonyms:
ras protein
Type:
Enzyme Catalytic Domain
Mol. Mass.:
4034.04
Organism:
Homo sapiens (Human)
Description:
gi_190938
Residue:
37
  
Inhibitor
Name:
BDBM54697
Synonyms:
1-(4-chlorophenyl)-3-phenyl-2-propyn-1-one 1-(4-chlorophenyl)-3-phenylprop-2-yn-1-one cid_582145
Type:
Small organic molecule
Emp. Form.:
C15H9ClO
Mol. Mass.:
240.684
SMILES:
Clc1ccc(cc1)C(=O)C#Cc1ccccc1
: