Target
GTPase KRas [1-37]
Ligand
BDBM54706
Substrate
Meas. Tech.
Additional SAR compounds tested via Multiplex dose response to identify specific small molecule inhibitors of Ras and Ras-related GTPases specifically Ras activated mutant
EC50
30000±n/a nM
Comments
Extracted from aid = 2043 and tid = 2
Citation
 PubChem, PC Additional SAR compounds tested via Multiplex dose response to identify specific small molecule inhibitors of Ras and Ras-related GTPases specifically Ras activated mutant PubChem Bioassay (2009)[AID] 
Target
Name:
GTPase KRas [1-37]
Synonyms:
ras protein
Type:
Enzyme Catalytic Domain
Mol. Mass.:
4034.04
Organism:
Homo sapiens (Human)
Description:
gi_190938
Residue:
37
  
Inhibitor
Name:
BDBM54706
Synonyms:
2-(6-methoxy-2-naphthalenyl)acetic acid 2-(6-methoxynaphthalen-2-yl)acetic acid UNM-0000306103 cid_32176
Type:
Small organic molecule
Emp. Form.:
C13H12O3
Mol. Mass.:
216.2326
SMILES:
COc1ccc2cc(CC(O)=O)ccc2c1
: