Target
Ras-related protein Rab-2A
Ligand
BDBM54700
Substrate
Meas. Tech.
Additional SAR compounds tested via Multiplex dose response to identify specific small molecule inhibitors of Ras and Ras-related GTPases specifically Rab2 wildtype
EC50
30000±n/a nM
Citation
 PubChem, PC Additional SAR compounds tested via Multiplex dose response to identify specific small molecule inhibitors of Ras and Ras-related GTPases specifically Rab2 wildtype PubChem Bioassay (2009)[AID] 
Target
Name:
Ras-related protein Rab-2A
Synonyms:
RAB2 RAB2A_CANLF | Ras-related protein Rab-2A.
Type:
Enzyme Catalytic Domain
Mol. Mass.:
23545.28
Organism:
Canis lupus familiaris
Description:
gi_46577642
Residue:
212
  
Inhibitor
Name:
BDBM54700
Synonyms:
3-phenyl-1-[4-(trifluoromethoxy)phenyl]-2-propyn-1-one 3-phenyl-1-[4-(trifluoromethyloxy)phenyl]prop-2-yn-1-one cid_25109936
Type:
Small organic molecule
Emp. Form.:
C16H9F3O2
Mol. Mass.:
290.2367
SMILES:
FC(F)(F)Oc1ccc(cc1)C(=O)C#Cc1ccccc1
: