Target
GTPase KRas [1-37]
Ligand
BDBM54619
Substrate
Meas. Tech.
Pyrazoline SAR compounds tested via Multiplex dose response to identify specific small molecule inhibitors of Ras and Ras-related GTPases specifically Ras wildtype
EC50
79±n/a nM
Citation
 PubChem, PC Pyrazoline SAR compounds tested via Multiplex dose response to identify specific small molecule inhibitors of Ras and Ras-related GTPases specifically Ras wildtype PubChem Bioassay (2009)[AID] 
Target
Name:
GTPase KRas [1-37]
Synonyms:
ras protein
Type:
Enzyme Catalytic Domain
Mol. Mass.:
4034.04
Organism:
Homo sapiens (Human)
Description:
gi_190938
Residue:
37
  
Inhibitor
Name:
BDBM54619
Synonyms:
3-(4-chlorophenyl)-5-(3,4-dimethoxyphenyl)-1-phenyl-2-pyrazoline UNM-0000305858 | cid_2883031
Type:
Small organic molecule
Emp. Form.:
C23H21ClN2O2
Mol. Mass.:
392.878
SMILES:
COc1ccc(cc1OC)C1CC(=NN1c1ccccc1)c1ccc(Cl)cc1
: