Target
Ras-related C3 botulinum toxin substrate 1
Ligand
BDBM54619
Substrate
Meas. Tech.
Pyrazoline SAR compounds tested via Multiplex dose response to identify specific small molecule inhibitors of Ras and Ras-related GTPases specifically Rac1 activated mutant
EC50
139±n/a nM
Citation
 PubChem, PC Pyrazoline SAR compounds tested via Multiplex dose response to identify specific small molecule inhibitors of Ras and Ras-related GTPases specifically Rac1 activated mutant PubChem Bioassay (2009)[AID] 
Target
Name:
Ras-related C3 botulinum toxin substrate 1
Synonyms:
RAC1_MOUSE Rac1 protein
Type:
PROTEIN
Mol. Mass.:
21455.91
Organism:
Mus musculus
Description:
EBI_101485
Residue:
192
  
Inhibitor
Name:
BDBM54619
Synonyms:
3-(4-chlorophenyl)-5-(3,4-dimethoxyphenyl)-1-phenyl-2-pyrazoline UNM-0000305858 | cid_2883031
Type:
Small organic molecule
Emp. Form.:
C23H21ClN2O2
Mol. Mass.:
392.878
SMILES:
COc1ccc(cc1OC)C1CC(=NN1c1ccccc1)c1ccc(Cl)cc1
: