Target
Dual specificity protein phosphatase 3
Ligand
BDBM31737
Substrate
Meas. Tech.
MOA VHR1 Fluorescent secondary assay for identification of redox-state modulating compounds
IC50
680±n/a nM
Citation
 PubChem, PC MOA VHR1 Fluorescent secondary assay for identification of redox-state modulating compounds PubChem Bioassay (2009)[AID] 
Target
Name:
Dual specificity protein phosphatase 3
Synonyms:
DUS3_HUMAN Dual specificity protein phosphatase (VHR) Dual specificity protein phosphatase VHR Tyrosine-protein phosphatase non-receptor type 1 | VHR
Type:
Hydrolase
Mol. Mass.:
20480.58
Organism:
Homo sapiens (Human)
Description:
Residue:
185
  
Inhibitor
Name:
BDBM31737
Synonyms:
2-[5-[(Z)-(1-keto-5,7-dimethyl-thiazolo[3,2-a]benzimidazol-2-ylidene)methyl]-2-furyl]benzoic acid 2-[5-[(Z)-(5,7-dimethyl-1-oxo-2-thiazolo[3,2-a]benzimidazolylidene)methyl]-2-furanyl]benzoic acid MLS-0091943.0001 | cid_5341943
Type:
Small organic molecule
Emp. Form.:
C23H16N2O4S
Mol. Mass.:
416.449
SMILES:
Cc1cc(C)c2nc3s\c(=C/c4ccc(o4)-c4ccccc4C(O)=O)c(=O)n3c2c1
: