Target
Mitogen-activated protein kinase kinase kinase 3
Ligand
BDBM54961
Substrate
Meas. Tech.
SAR Compounds tested by Dose Response Screen via Multiplex HTS Assay for Inhibitors of MEK Kinase PB1 Domains, specifically MEK5 binding to MEK Kinase 3 Wildtype.
EC50
1100±n/a nM
Citation
 PubChem, PC SAR Compounds tested by Dose Response Screen via Multiplex HTS Assay for Inhibitors of MEK Kinase PB1 Domains, specifically MEK5 binding to MEK Kinase 3 Wildtype. PubChem Bioassay (2009)[AID] 
Target
Name:
Mitogen-activated protein kinase kinase kinase 3
Synonyms:
M3K3_HUMAN MAPKKK3 Mitogen-activated protein kinase kinase kinase 3 | mitogen-activated protein kinase kinase kinase 3 isoform 1
Type:
PROTEIN
Mol. Mass.:
70916.05
Organism:
Homo sapiens (Human)
Description:
ChEMBL_774345
Residue:
626
  
Inhibitor
Name:
BDBM54961
Synonyms:
6-(3-ethoxyphenyl)-3-thiophen-2-yl-[1,2,4]triazolo[3,4-b][1,3,4]thiadiazole VU0365506-1 | cid_16476066
Type:
Small organic molecule
Emp. Form.:
C15H12N4OS2
Mol. Mass.:
328.412
SMILES:
CCOc1cccc(c1)-c1nn2c(nnc2s1)-c1cccs1
: