Target
Guanyl-specific ribonuclease T1
Ligand
BDBM44482
Substrate
Meas. Tech.
Counterscreen for inhibitors of tRNA 2'-phosphotransferase (TPT1): fluorescence polarization-based biochemical high throughput dose response assay to identify inhibitors of RNAse T1.
IC50
9846±n/a nM
Citation
 PubChem, PC Counterscreen for inhibitors of tRNA 2'-phosphotransferase (TPT1): fluorescence polarization-based biochemical high throughput dose response assay to identify inhibitors of RNAse T1. PubChem Bioassay (2009)[AID] 
Target
Name:
Guanyl-specific ribonuclease T1
Synonyms:
RNT1_ASPOR unnamed protein product
Type:
Enzyme Catalytic Domain
Mol. Mass.:
13952.57
Organism:
Aspergillus oryzae
Description:
gi_83774548
Residue:
130
  
Inhibitor
Name:
BDBM44482
Synonyms:
2-[(5Z)-5-[(E)-3-(2-furanyl)prop-2-enylidene]-4-oxo-2-sulfanylidene-3-thiazolidinyl]-3-methylbutanoic acid 2-[(5Z)-5-[(E)-3-(furan-2-yl)prop-2-enylidene]-4-oxidanylidene-2-sulfanylidene-1,3-thiazolidin-3-yl]-3-methyl-butanoic acid 2-{5-[(E)-3-Furan-2-yl-prop-2-en-(Z)-ylidene]-4-oxo-2-thioxo-thiazolidin-3-yl}-3-methyl-butyric acid SMR000145597 | cid_6393068
Type:
Small organic molecule
Emp. Form.:
C15H15NO4S2
Mol. Mass.:
337.414
SMILES:
CC(C)C(N1C(=S)S\C(=C/C=C/c2ccco2)C1=O)C(O)=O
: