Target
Guanyl-specific ribonuclease T1
Ligand
BDBM50729
Substrate
Meas. Tech.
Counterscreen for inhibitors of tRNA 2'-phosphotransferase (TPT1): fluorescence polarization-based biochemical high throughput dose response assay to identify inhibitors of RNAse T1.
IC50
18474±n/a nM
Citation
 PubChem, PC Counterscreen for inhibitors of tRNA 2'-phosphotransferase (TPT1): fluorescence polarization-based biochemical high throughput dose response assay to identify inhibitors of RNAse T1. PubChem Bioassay (2009)[AID] 
Target
Name:
Guanyl-specific ribonuclease T1
Synonyms:
RNT1_ASPOR unnamed protein product
Type:
Enzyme Catalytic Domain
Mol. Mass.:
13952.57
Organism:
Aspergillus oryzae
Description:
gi_83774548
Residue:
130
  
Inhibitor
Name:
BDBM50729
Synonyms:
MLS000778639 N-[(5Z)-5-[(E)-3-(2-furyl)prop-2-enylidene]-4-keto-2-thioxo-thiazolidin-3-yl]benzenesulfonamide N-[(5Z)-5-[(E)-3-(furan-2-yl)prop-2-enylidene]-4-oxo-2-sulfanylidene-1,3-thiazolidin-3-yl]benzenesulfonamide SMR000415433 | cid_6393804
Type:
Small organic molecule
Emp. Form.:
C16H12N2O4S3
Mol. Mass.:
392.472
SMILES:
O=C1N(NS(=O)(=O)c2ccccc2)C(=S)S\C1=C/C=C/c1ccco1
: