Target
M18 aspartyl aminopeptidase
Ligand
BDBM55096
Substrate
Meas. Tech.
QFRET-based biochemical high throughput dose response assay for inhibitors of the Plasmodium falciparum M18 Aspartyl Aminopeptidase (PFM18AAP).
IC50
1272±n/a nM
Citation
 PubChem, PC QFRET-based biochemical high throughput dose response assay for inhibitors of the Plasmodium falciparum M18 Aspartyl Aminopeptidase (PFM18AAP). PubChem Bioassay (2009)[AID] 
Target
Name:
M18 aspartyl aminopeptidase
Synonyms:
Type:
Enzyme Catalytic Domain
Mol. Mass.:
65642.43
Organism:
Plasmodium falciparum 3D7
Description:
gi_23505220
Residue:
570
  
Inhibitor
Name:
BDBM55096
Synonyms:
3-Tetrazol-1-yl-1H-pyrazole-4-carboxylic acid 5-(1-tetrazolyl)-1H-pyrazole-4-carboxylic acid MLS000068216 cid_645797
Type:
Small organic molecule
Emp. Form.:
C5H4N6O2
Mol. Mass.:
180.1243
SMILES:
OC(=O)c1c[nH]nc1-n1cnnn1
: