Target
M18 aspartyl aminopeptidase
Ligand
BDBM55097
Substrate
Meas. Tech.
QFRET-based biochemical high throughput dose response assay for inhibitors of the Plasmodium falciparum M18 Aspartyl Aminopeptidase (PFM18AAP).
IC50
201.7±n/a nM
Citation
 PubChem, PC QFRET-based biochemical high throughput dose response assay for inhibitors of the Plasmodium falciparum M18 Aspartyl Aminopeptidase (PFM18AAP). PubChem Bioassay (2009)[AID] 
Target
Name:
M18 aspartyl aminopeptidase
Synonyms:
Type:
Enzyme Catalytic Domain
Mol. Mass.:
65642.43
Organism:
Plasmodium falciparum 3D7
Description:
gi_23505220
Residue:
570
  
Inhibitor
Name:
BDBM55097
Synonyms:
(4H-[1,2,4]Triazol-3-ylsulfanyl)-acetic acid 2-(1H-1,2,4-triazol-5-ylsulfanyl)ethanoic acid MLS000073496 cid_646171
Type:
Small organic molecule
Emp. Form.:
C4H5N3O2S
Mol. Mass.:
159.166
SMILES:
OC(=O)CSc1nnc[nH]1
: