Target
M18 aspartyl aminopeptidase
Ligand
BDBM55110
Substrate
Meas. Tech.
QFRET-based biochemical high throughput dose response assay for inhibitors of the Plasmodium falciparum M18 Aspartyl Aminopeptidase (PFM18AAP).
IC50
711.31±n/a nM
Citation
 PubChem, PC QFRET-based biochemical high throughput dose response assay for inhibitors of the Plasmodium falciparum M18 Aspartyl Aminopeptidase (PFM18AAP). PubChem Bioassay (2009)[AID] 
Target
Name:
M18 aspartyl aminopeptidase
Synonyms:
Type:
Enzyme Catalytic Domain
Mol. Mass.:
65642.43
Organism:
Plasmodium falciparum 3D7
Description:
gi_23505220
Residue:
570
  
Inhibitor
Name:
BDBM55110
Synonyms:
1-(4-bromanyl-2-chloranyl-phenyl)-3-(1,2,4-triazol-4-yl)urea 1-(4-bromo-2-chlorophenyl)-3-(1,2,4-triazol-4-yl)urea N-(4-bromo-2-chlorophenyl)-N'-4H-1,2,4-triazol-4-ylurea cid_978221
Type:
Small organic molecule
Emp. Form.:
C9H7BrClN5O
Mol. Mass.:
316.542
SMILES:
Clc1cc(Br)ccc1NC(=O)Nn1cnnc1
: