Target
M18 aspartyl aminopeptidase
Ligand
BDBM55112
Substrate
Meas. Tech.
QFRET-based biochemical high throughput dose response assay for inhibitors of the Plasmodium falciparum M18 Aspartyl Aminopeptidase (PFM18AAP).
IC50
663.8±n/a nM
Citation
 PubChem, PC QFRET-based biochemical high throughput dose response assay for inhibitors of the Plasmodium falciparum M18 Aspartyl Aminopeptidase (PFM18AAP). PubChem Bioassay (2009)[AID] 
Target
Name:
M18 aspartyl aminopeptidase
Synonyms:
Type:
Enzyme Catalytic Domain
Mol. Mass.:
65642.43
Organism:
Plasmodium falciparum 3D7
Description:
gi_23505220
Residue:
570
  
Inhibitor
Name:
BDBM55112
Synonyms:
3-methyl-N-(1,2,4-triazol-4-yl)-1-benzofuran-2-carboxamide 3-methyl-N-(1,2,4-triazol-4-yl)coumarilamide MLS000051531 cid_2302032
Type:
Small organic molecule
Emp. Form.:
C12H10N4O2
Mol. Mass.:
242.2334
SMILES:
Cc1c(oc2ccccc12)C(=O)Nn1cnnc1
: