Target
M18 aspartyl aminopeptidase
Ligand
BDBM55117
Substrate
Meas. Tech.
QFRET-based biochemical high throughput dose response assay for inhibitors of the Plasmodium falciparum M18 Aspartyl Aminopeptidase (PFM18AAP).
IC50
497.28±n/a nM
Citation
 PubChem, PC QFRET-based biochemical high throughput dose response assay for inhibitors of the Plasmodium falciparum M18 Aspartyl Aminopeptidase (PFM18AAP). PubChem Bioassay (2009)[AID] 
Target
Name:
M18 aspartyl aminopeptidase
Synonyms:
Type:
Enzyme Catalytic Domain
Mol. Mass.:
65642.43
Organism:
Plasmodium falciparum 3D7
Description:
gi_23505220
Residue:
570
  
Inhibitor
Name:
BDBM55117
Synonyms:
2-[benzenesulfonyl(1,2,4-triazol-4-yl)amino]acetic acid methyl ester MLS000111921 cid_805790 methyl 2-[phenylsulfonyl(1,2,4-triazol-4-yl)amino]ethanoate
Type:
Small organic molecule
Emp. Form.:
C11H12N4O4S
Mol. Mass.:
296.302
SMILES:
COC(=O)CN(n1cnnc1)S(=O)(=O)c1ccccc1
: