Target
M18 aspartyl aminopeptidase
Ligand
BDBM55126
Substrate
Meas. Tech.
QFRET-based biochemical high throughput dose response assay for inhibitors of the Plasmodium falciparum M18 Aspartyl Aminopeptidase (PFM18AAP).
IC50
1251±n/a nM
Citation
 PubChem, PC QFRET-based biochemical high throughput dose response assay for inhibitors of the Plasmodium falciparum M18 Aspartyl Aminopeptidase (PFM18AAP). PubChem Bioassay (2009)[AID] 
Target
Name:
M18 aspartyl aminopeptidase
Synonyms:
Type:
Enzyme Catalytic Domain
Mol. Mass.:
65642.43
Organism:
Plasmodium falciparum 3D7
Description:
gi_23505220
Residue:
570
  
Inhibitor
Name:
BDBM55126
Synonyms:
3,3-dimethyl-7,8-bis(oxidanyl)-2,4-dihydrodibenzofuran-1-one 7,8-dihydroxy-3,3-dimethyl-3,4-dihydrodibenzo[b,d]furan-1(2H)-one SMR000135628 | cid_363815
Type:
Small organic molecule
Emp. Form.:
C14H14O4
Mol. Mass.:
246.2586
SMILES:
CC1(C)Cc2oc3cc(O)c(O)cc3c2C(=O)C1
: