Target
M18 aspartyl aminopeptidase
Ligand
BDBM55135
Substrate
Meas. Tech.
QFRET-based biochemical high throughput dose response assay for inhibitors of the Plasmodium falciparum M18 Aspartyl Aminopeptidase (PFM18AAP).
IC50
1502±n/a nM
Citation
 PubChem, PC QFRET-based biochemical high throughput dose response assay for inhibitors of the Plasmodium falciparum M18 Aspartyl Aminopeptidase (PFM18AAP). PubChem Bioassay (2009)[AID] 
Target
Name:
M18 aspartyl aminopeptidase
Synonyms:
Type:
Enzyme Catalytic Domain
Mol. Mass.:
65642.43
Organism:
Plasmodium falciparum 3D7
Description:
gi_23505220
Residue:
570
  
Inhibitor
Name:
BDBM55135
Synonyms:
2-bromanyl-N-(1,2,4-triazol-4-ylcarbamothioyl)benzamide 2-bromo-N-(1,2,4-triazol-4-ylthiocarbamoyl)benzamide MLS000392642 cid_2375959
Type:
Small organic molecule
Emp. Form.:
C10H8BrN5OS
Mol. Mass.:
326.172
SMILES:
Brc1ccccc1C(=O)NC(=S)Nn1cnnc1
: