Target
M18 aspartyl aminopeptidase
Ligand
BDBM55145
Substrate
Meas. Tech.
QFRET-based biochemical high throughput dose response assay for inhibitors of the Plasmodium falciparum M18 Aspartyl Aminopeptidase (PFM18AAP).
IC50
833.02±n/a nM
Citation
 PubChem, PC QFRET-based biochemical high throughput dose response assay for inhibitors of the Plasmodium falciparum M18 Aspartyl Aminopeptidase (PFM18AAP). PubChem Bioassay (2009)[AID] 
Target
Name:
M18 aspartyl aminopeptidase
Synonyms:
Type:
Enzyme Catalytic Domain
Mol. Mass.:
65642.43
Organism:
Plasmodium falciparum 3D7
Description:
gi_23505220
Residue:
570
  
Inhibitor
Name:
BDBM55145
Synonyms:
2-(1H-1,2,4-triazol-5-ylsulfanylmethyl)-1H-quinazolin-4-one MLS000759871 cid_1505700
Type:
Small organic molecule
Emp. Form.:
C11H9N5OS
Mol. Mass.:
259.287
SMILES:
O=c1[nH]c(CSc2nnc[nH]2)nc2ccccc12
: