Target
M18 aspartyl aminopeptidase
Ligand
BDBM55151
Substrate
Meas. Tech.
QFRET-based biochemical high throughput dose response assay for inhibitors of the Plasmodium falciparum M18 Aspartyl Aminopeptidase (PFM18AAP).
IC50
1486±n/a nM
Citation
 PubChem, PC QFRET-based biochemical high throughput dose response assay for inhibitors of the Plasmodium falciparum M18 Aspartyl Aminopeptidase (PFM18AAP). PubChem Bioassay (2009)[AID] 
Target
Name:
M18 aspartyl aminopeptidase
Synonyms:
Type:
Enzyme Catalytic Domain
Mol. Mass.:
65642.43
Organism:
Plasmodium falciparum 3D7
Description:
gi_23505220
Residue:
570
  
Inhibitor
Name:
BDBM55151
Synonyms:
1-(3,4-Dihydroxy-phenyl)-2-(4-hydroxy-6-methyl-pyrimidin-2-ylsulfanyl)-ethanone 2-[2-[3,4-bis(oxidanyl)phenyl]-2-oxidanylidene-ethyl]sulfanyl-6-methyl-1H-pyrimidin-4-one 2-[[2-(3,4-dihydroxyphenyl)-2-oxoethyl]thio]-6-methyl-1H-pyrimidin-4-one MLS001212148 cid_687937
Type:
Small organic molecule
Emp. Form.:
C13H12N2O4S
Mol. Mass.:
292.31
SMILES:
Cc1cc(=O)[nH]c(SCC(=O)c2ccc(O)c(O)c2)n1
: