Target
M18 aspartyl aminopeptidase
Ligand
BDBM55153
Substrate
Meas. Tech.
QFRET-based biochemical high throughput dose response assay for inhibitors of the Plasmodium falciparum M18 Aspartyl Aminopeptidase (PFM18AAP).
IC50
863.54±n/a nM
Citation
 PubChem, PC QFRET-based biochemical high throughput dose response assay for inhibitors of the Plasmodium falciparum M18 Aspartyl Aminopeptidase (PFM18AAP). PubChem Bioassay (2009)[AID] 
Target
Name:
M18 aspartyl aminopeptidase
Synonyms:
Type:
Enzyme Catalytic Domain
Mol. Mass.:
65642.43
Organism:
Plasmodium falciparum 3D7
Description:
gi_23505220
Residue:
570
  
Inhibitor
Name:
BDBM55153
Synonyms:
4-(3,4-Dihydroxy-phenyl)-6-methyl-5-nitro-3,4-dihydro-1H-pyrimidin-2-one 4-[3,4-bis(oxidanyl)phenyl]-6-methyl-5-nitro-3,4-dihydro-1H-pyrimidin-2-one SMR000504835 | cid_2831285
Type:
Small organic molecule
Emp. Form.:
C11H11N3O5
Mol. Mass.:
265.2221
SMILES:
CC1=NC(=O)NC(C1[N+]([O-])=O)c1ccc(O)c(O)c1
: