Target
M18 aspartyl aminopeptidase
Ligand
BDBM55154
Substrate
Meas. Tech.
QFRET-based biochemical high throughput dose response assay for inhibitors of the Plasmodium falciparum M18 Aspartyl Aminopeptidase (PFM18AAP).
IC50
>100.76±n/a nM
Citation
 PubChem, PC QFRET-based biochemical high throughput dose response assay for inhibitors of the Plasmodium falciparum M18 Aspartyl Aminopeptidase (PFM18AAP). PubChem Bioassay (2009)[AID] 
Target
Name:
M18 aspartyl aminopeptidase
Synonyms:
Type:
Enzyme Catalytic Domain
Mol. Mass.:
65642.43
Organism:
Plasmodium falciparum 3D7
Description:
gi_23505220
Residue:
570
  
Inhibitor
Name:
BDBM55154
Synonyms:
2-benzyl-4,6-dinitro-1,2-benzisothiazol-3(2H)-one 4,6-dinitro-2-(phenylmethyl)-1,2-benzothiazol-3-one SMR000559116 | cid_4652205
Type:
Small organic molecule
Emp. Form.:
C14H9N3O5S
Mol. Mass.:
331.303
SMILES:
[O-][N+](=O)c1cc([N+]([O-])=O)c2c(c1)sn(Cc1ccccc1)c2=O
: