Target
Cyclin-dependent kinase 1
Ligand
BDBM59106
Substrate
Meas. Tech.
In Vitro Kinase Assay
pH
7.2±0
IC50
>10000±0.0 nM
Citation
 Wan, YHur, WCho, CYLiu, YAdrian, FJLozach, OBach, SMayer, TFabbro, DMeijer, LGray, NS Synthesis and target identification of hymenialdisine analogs. Chem Biol 11:247-59 (2004)  
Target
Name:
Cyclin-dependent kinase 1
Synonyms:
CDC2 CDK1 CDKN1 Cell division protein kinase 1 P34CDC2 | p34 protein kinase
Type:
Enzyme Subunit
Mol. Mass.:
34101.08
Organism:
Homo sapiens (Human)
Description:
P06493
Residue:
297
  
Inhibitor
Name:
BDBM59106
Synonyms:
Hymenialdisine, 17
Type:
Small organic molecule
Emp. Form.:
C13H13Br2N5O2
Mol. Mass.:
431.083
SMILES:
CCNC1=NC(=O)C(N1)=C1CCNC(=O)c2[nH]c(Br)c(Br)c12
: