Target
Adenosine receptor A2a
Ligand
BDBM50208817
Substrate
Meas. Tech.
Binding Assay
pH
7.4±0
Temperature
298.15±0 K
Ki
1140±180 nM
Citation
 Jacobson, KAOhno, MDuong, HTKim, SKTchilibon, SCesnek, MHolý, AGao, ZG A neoceptor approach to unraveling microscopic interactions between the human A2A adenosine receptor and its agonists. Chem Biol 12:237-47 (2005)  
Target
Name:
Adenosine receptor A2a
Synonyms:
A2A adenosine receptor (hA2A) ADENOSINE A2 ADORA2 Adenosine A2A receptor (A2AAR)
Type:
G Protein-Coupled Receptor (GPCR)
Mol. Mass.:
44716.46
Organism:
Homo sapiens (Human)
Description:
P29274
Residue:
412
  
Inhibitor
Name:
BDBM50208817
Synonyms:
(2S,3S,4R,5R)-N-ethyl-5-(6-guanidino-9H-purin-9-yl)-3,4-dihydroxy-tetrahydrofuran-2-carboxamide CHEMBL376542
Type:
Small organic molecule
Emp. Form.:
C13H18N8O4
Mol. Mass.:
350.3332
SMILES:
[#6]-[#6]-[#7]-[#6](=O)-[#6@H]-1-[#8]-[#6@H](-[#6@H](-[#8])-[#6@@H]-1-[#8])-n1cnc2c(\[#7]=[#6](/[#7])-[#7])ncnc12
: