Target
M17 leucyl aminopeptidase
Ligand
BDBM47275
Substrate
Meas. Tech.
Inhibitors of Plasmodium falciparum M17- Family Leucine Aminopeptidase (M17LAP)
IC50
110220±n/a nM
Citation
 PubChem, PC Inhibitors of Plasmodium falciparum M17- Family Leucine Aminopeptidase (M17LAP) PubChem Bioassay (2009)[AID] 
Target
Name:
M17 leucyl aminopeptidase
Synonyms:
leucine aminopeptidase
Type:
Enzyme Catalytic Domain
Mol. Mass.:
67834.32
Organism:
Plasmodium falciparum 3D7
Description:
gi_124809582
Residue:
605
  
Inhibitor
Name:
BDBM47275
Synonyms:
4-[(E)-2-(1-ethyl-2-quinolin-1-iumyl)ethenyl]-N,N-dimethylaniline;iodide 4-[(E)-2-(1-ethylquinolin-1-ium-2-yl)ethenyl]-N,N-dimethylaniline;iodide SMR000264929 cid_5702759
Type:
Small organic molecule
Emp. Form.:
C21H23N2
Mol. Mass.:
303.4202
SMILES:
CC[n+]1c(\C=C\c2ccc(cc2)N(C)C)ccc2ccccc12
: