Target
M17 leucyl aminopeptidase
Ligand
BDBM51992
Substrate
Meas. Tech.
Inhibitors of Plasmodium falciparum M17- Family Leucine Aminopeptidase (M17LAP)
IC50
13350±n/a nM
Citation
 PubChem, PC Inhibitors of Plasmodium falciparum M17- Family Leucine Aminopeptidase (M17LAP) PubChem Bioassay (2009)[AID] 
Target
Name:
M17 leucyl aminopeptidase
Synonyms:
leucine aminopeptidase
Type:
Enzyme Catalytic Domain
Mol. Mass.:
67834.32
Organism:
Plasmodium falciparum 3D7
Description:
gi_124809582
Residue:
605
  
Inhibitor
Name:
BDBM51992
Synonyms:
3-[[(E)-[2-(4-bromobenzyl)oxybenzylidene]amino]thiocarbamoylamino]benzoic acid 3-[[[2-[(4-bromophenyl)methoxy]phenyl]methylideneamino]carbamothioylamino]benzoic acid 3-{[(2-{2-[(4-bromobenzyl)oxy]benzylidene}hydrazino)carbonothioyl]amino}benzoic acid SMR000312756 | cid_16195462
Type:
Small organic molecule
Emp. Form.:
C22H18BrN3O3S
Mol. Mass.:
484.366
SMILES:
OC(=O)c1cccc(NC(=S)NN=Cc2ccccc2OCc2ccc(Br)cc2)c1
: