Target
Eukaryotic translation initiation factor 4H
Ligand
BDBM61355
Substrate
Meas. Tech.
uHTS fluorescence polarization assay for the identification of translation initiation inhibitors (eIF4H)
IC50
100000±n/a nM
Citation
 PubChem, PC uHTS fluorescence polarization assay for the identification of translation initiation inhibitors (eIF4H) PubChem Bioassay (2009)[AID] 
Target
Name:
Eukaryotic translation initiation factor 4H
Synonyms:
EIF4H KIAA0038 WSCR1
Type:
Enzyme Catalytic Domain
Mol. Mass.:
27385.24
Organism:
Homo sapiens (Human)
Description:
Q15056
Residue:
248
  
Inhibitor
Name:
BDBM61355
Synonyms:
5-ethyl-6-keto-benzo[b][1,4]benzothiazepine-3-carboxylic acid ethyl ester MLS001200975 cid_4083983 ethyl 5-ethyl-6-oxidanylidene-benzo[b][1,4]benzothiazepine-3-carboxylate | ethyl 5-ethyl-6-oxobenzo[b][1,4]benzothiazepine-3-carboxylate
Type:
Small organic molecule
Emp. Form.:
C18H17NO3S
Mol. Mass.:
327.397
SMILES:
CCOC(=O)c1ccc2Sc3ccccc3C(=O)N(CC)c2c1
: