Target
G-protein coupled receptor 55
Ligand
BDBM61541
Substrate
Meas. Tech.
Image-Based HTS for Selective Antagonists for GPR55
IC50
3254.895±n/a nM
Citation
 PubChem, PC Image-Based HTS for Selective Antagonists for GPR55 PubChem Bioassay (2010)[AID] 
Target
Name:
G-protein coupled receptor 55
Synonyms:
G protein-coupled receptor 55 GPR55_HUMAN
Type:
PROTEIN
Mol. Mass.:
36649.72
Organism:
Homo sapiens (Human)
Description:
ChEMBL_1292265
Residue:
319
  
Inhibitor
Name:
BDBM61541
Synonyms:
(Z)-2,3-bis(chloranyl)-3-[(2-chlorophenyl)methylsulfinyl]-N-(6-methoxypyridin-3-yl)prop-2-enamide (Z)-2,3-dichloro-3-[(2-chlorophenyl)methylsulfinyl]-N-(6-methoxy-3-pyridinyl)-2-propenamide 2,3-dichloro-3-[(2-chlorobenzyl)sulfinyl]-N-(6-methoxy-3-pyridinyl)acrylamide SMR000334342 | cid_1475345
Type:
Small organic molecule
Emp. Form.:
C16H13Cl3N2O3S
Mol. Mass.:
419.71
SMILES:
COc1ccc(NC(=O)C(Cl)=C(Cl)S(=O)Cc2ccccc2Cl)cn1
: