Target
Polyadenylate-binding protein 1
Ligand
BDBM61262
Substrate
Meas. Tech.
uHTS fluorescence polarization assay for the identification of translation initiation inhibitors (PABP)
IC50
3565±n/a nM
Citation
 PubChem, PC uHTS fluorescence polarization assay for the identification of translation initiation inhibitors (PABP) PubChem Bioassay (2009)[AID] 
Target
Name:
Polyadenylate-binding protein 1
Synonyms:
PAB1 PABP1 PABPC1 poly(A) binding protein, cytoplasmic 1 | polyadenylate-binding protein 1
Type:
Enzyme Catalytic Domain
Mol. Mass.:
70694.26
Organism:
Homo sapiens (Human)
Description:
gi_46367787
Residue:
636
  
Inhibitor
Name:
BDBM61262
Synonyms:
(2-Methoxy-phenyl)-[3-methyl-[1,3]thiazinan-(2E)-ylidene]-amine MLS000074721 SMR000007817 | cid_6603191
Type:
Small organic molecule
Emp. Form.:
C12H16N2OS
Mol. Mass.:
236.333
SMILES:
COc1ccccc1\N=C1/SCCCN1C
: