Target
Polyadenylate-binding protein 1
Ligand
BDBM31699
Substrate
Meas. Tech.
uHTS fluorescence polarization assay for the identification of translation initiation inhibitors (PABP)
IC50
100000±n/a nM
Citation
 PubChem, PC uHTS fluorescence polarization assay for the identification of translation initiation inhibitors (PABP) PubChem Bioassay (2009)[AID] 
Target
Name:
Polyadenylate-binding protein 1
Synonyms:
PAB1 PABP1 PABPC1 poly(A) binding protein, cytoplasmic 1 | polyadenylate-binding protein 1
Type:
Enzyme Catalytic Domain
Mol. Mass.:
70694.26
Organism:
Homo sapiens (Human)
Description:
gi_46367787
Residue:
636
  
Inhibitor
Name:
BDBM31699
Synonyms:
(4-methoxy-1,3-benzothiazol-2-yl)-[5-(4-methoxyphenyl)-1,3,4-oxadiazol-2-yl]amine MLS000045458 SMR000027218 | cid_3236395
Type:
Small organic molecule
Emp. Form.:
C17H14N4O3S
Mol. Mass.:
354.383
SMILES:
COc1ccc(cc1)-c1nnc(Nc2nc3c(OC)cccc3s2)o1
: