Target
Polyadenylate-binding protein 1
Ligand
BDBM61280
Substrate
Meas. Tech.
uHTS fluorescence polarization assay for the identification of translation initiation inhibitors (PABP)
IC50
6610±n/a nM
Citation
 PubChem, PC uHTS fluorescence polarization assay for the identification of translation initiation inhibitors (PABP) PubChem Bioassay (2009)[AID] 
Target
Name:
Polyadenylate-binding protein 1
Synonyms:
PAB1 PABP1 PABPC1 poly(A) binding protein, cytoplasmic 1 | polyadenylate-binding protein 1
Type:
Enzyme Catalytic Domain
Mol. Mass.:
70694.26
Organism:
Homo sapiens (Human)
Description:
gi_46367787
Residue:
636
  
Inhibitor
Name:
BDBM61280
Synonyms:
MLS000519231 N-(3,4-dimethylphenyl)-2-[[5-[3-(4-methoxyphenyl)propyl]-1,3,4-oxadiazol-2-yl]sulfanyl]ethanamide SMR000129650 | cid_4303657
Type:
Small organic molecule
Emp. Form.:
C22H25N3O3S
Mol. Mass.:
411.517
SMILES:
COc1ccc(CCCc2nnc(SCC(=O)Nc3ccc(C)c(C)c3)o2)cc1
: