Target
Polyadenylate-binding protein 1
Ligand
BDBM61314
Substrate
Meas. Tech.
uHTS fluorescence polarization assay for the identification of translation initiation inhibitors (PABP)
IC50
6535±n/a nM
Citation
 PubChem, PC uHTS fluorescence polarization assay for the identification of translation initiation inhibitors (PABP) PubChem Bioassay (2009)[AID] 
Target
Name:
Polyadenylate-binding protein 1
Synonyms:
PAB1 PABP1 PABPC1 poly(A) binding protein, cytoplasmic 1 | polyadenylate-binding protein 1
Type:
Enzyme Catalytic Domain
Mol. Mass.:
70694.26
Organism:
Homo sapiens (Human)
Description:
gi_46367787
Residue:
636
  
Inhibitor
Name:
BDBM61314
Synonyms:
(1-methylpyridin-1-ium-2-yl)-(1-methyl-2-pyridylidene)amine;iodide 1-methyl-N-(1-methyl-2-pyridin-1-iumyl)-2-pyridinimine;iodide MLS001030036 cid_2848485
Type:
Small organic molecule
Emp. Form.:
C12H14N3
Mol. Mass.:
200.2591
SMILES:
Cn1ccccc1=Nc1cccc[n+]1C
: