Target
Polyadenylate-binding protein 1
Ligand
BDBM61332
Substrate
Meas. Tech.
uHTS fluorescence polarization assay for the identification of translation initiation inhibitors (PABP)
IC50
5630±n/a nM
Citation
 PubChem, PC uHTS fluorescence polarization assay for the identification of translation initiation inhibitors (PABP) PubChem Bioassay (2009)[AID] 
Target
Name:
Polyadenylate-binding protein 1
Synonyms:
PAB1 PABP1 PABPC1 poly(A) binding protein, cytoplasmic 1 | polyadenylate-binding protein 1
Type:
Enzyme Catalytic Domain
Mol. Mass.:
70694.26
Organism:
Homo sapiens (Human)
Description:
gi_46367787
Residue:
636
  
Inhibitor
Name:
BDBM61332
Synonyms:
4-(2-Methoxy-phenylcarbamoyl)-1-methyl-pyridinium N-(2-methoxyphenyl)-1-methyl-4-pyridin-1-iumcarboxamide;iodide N-(2-methoxyphenyl)-1-methylpyridin-1-ium-4-carboxamide;iodide cid_16240614
Type:
Small organic molecule
Emp. Form.:
C14H15N2O2
Mol. Mass.:
243.2806
SMILES:
COc1ccccc1NC(=O)c1cc[n+](C)cc1
: