Target
Polyadenylate-binding protein 1
Ligand
BDBM61339
Substrate
Meas. Tech.
uHTS fluorescence polarization assay for the identification of translation initiation inhibitors (PABP)
IC50
2220±n/a nM
Citation
 PubChem, PC uHTS fluorescence polarization assay for the identification of translation initiation inhibitors (PABP) PubChem Bioassay (2009)[AID] 
Target
Name:
Polyadenylate-binding protein 1
Synonyms:
PAB1 PABP1 PABPC1 poly(A) binding protein, cytoplasmic 1 | polyadenylate-binding protein 1
Type:
Enzyme Catalytic Domain
Mol. Mass.:
70694.26
Organism:
Homo sapiens (Human)
Description:
gi_46367787
Residue:
636
  
Inhibitor
Name:
BDBM61339
Synonyms:
2-[(2Z)-2-[(1-methyl-2-pyridin-1-iumyl)methylidene]-1,3-benzothiazol-3-yl]ethanol;iodide 2-[(2Z)-2-[(1-methylpyridin-1-ium-2-yl)methylidene]-1,3-benzothiazol-3-yl]ethanol;iodide MLS001212885 cid_24747025
Type:
Small organic molecule
Emp. Form.:
C16H17N2OS
Mol. Mass.:
285.383
SMILES:
C[n+]1ccccc1\C=C1/Sc2ccccc2N1CCO
: