Target
Polyadenylate-binding protein 1
Ligand
BDBM61348
Substrate
Meas. Tech.
uHTS fluorescence polarization assay for the identification of translation initiation inhibitors (PABP)
IC50
6160±n/a nM
Citation
 PubChem, PC uHTS fluorescence polarization assay for the identification of translation initiation inhibitors (PABP) PubChem Bioassay (2009)[AID] 
Target
Name:
Polyadenylate-binding protein 1
Synonyms:
PAB1 PABP1 PABPC1 poly(A) binding protein, cytoplasmic 1 | polyadenylate-binding protein 1
Type:
Enzyme Catalytic Domain
Mol. Mass.:
70694.26
Organism:
Homo sapiens (Human)
Description:
gi_46367787
Residue:
636
  
Inhibitor
Name:
BDBM61348
Synonyms:
(6E)-1-methyl-6-p-anisylidene-piperazine-2,5-quinone (6E)-6-[(4-methoxyphenyl)methylidene]-1-methylpiperazine-2,5-dione MLS001166322 cid_5890427
Type:
Small organic molecule
Emp. Form.:
C13H14N2O3
Mol. Mass.:
246.2619
SMILES:
COc1ccc(\C=C2\N(C)C(=O)CNC2=O)cc1
: