Target
Polyadenylate-binding protein 1
Ligand
BDBM61360
Substrate
Meas. Tech.
uHTS fluorescence polarization assay for the identification of translation initiation inhibitors (PABP)
IC50
6515±n/a nM
Citation
 PubChem, PC uHTS fluorescence polarization assay for the identification of translation initiation inhibitors (PABP) PubChem Bioassay (2009)[AID] 
Target
Name:
Polyadenylate-binding protein 1
Synonyms:
PAB1 PABP1 PABPC1 poly(A) binding protein, cytoplasmic 1 | polyadenylate-binding protein 1
Type:
Enzyme Catalytic Domain
Mol. Mass.:
70694.26
Organism:
Homo sapiens (Human)
Description:
gi_46367787
Residue:
636
  
Inhibitor
Name:
BDBM61360
Synonyms:
1-(Thiophene-2-carbonyl)-piperidine-4-carboxylic acid (2,4-dimethyl-phenyl)-amide N-(2,4-dimethylphenyl)-1-(2-thenoyl)isonipecotamide N-(2,4-dimethylphenyl)-1-[oxo(thiophen-2-yl)methyl]-4-piperidinecarboxamide SMR000611955 | cid_1075533
Type:
Small organic molecule
Emp. Form.:
C19H22N2O2S
Mol. Mass.:
342.455
SMILES:
Cc1ccc(NC(=O)C2CCN(CC2)C(=O)c2cccs2)c(C)c1
: