Target
Polyadenylate-binding protein 1
Ligand
BDBM61379
Substrate
Meas. Tech.
uHTS fluorescence polarization assay for the identification of translation initiation inhibitors (PABP)
IC50
6350±n/a nM
Citation
 PubChem, PC uHTS fluorescence polarization assay for the identification of translation initiation inhibitors (PABP) PubChem Bioassay (2009)[AID] 
Target
Name:
Polyadenylate-binding protein 1
Synonyms:
PAB1 PABP1 PABPC1 poly(A) binding protein, cytoplasmic 1 | polyadenylate-binding protein 1
Type:
Enzyme Catalytic Domain
Mol. Mass.:
70694.26
Organism:
Homo sapiens (Human)
Description:
gi_46367787
Residue:
636
  
Inhibitor
Name:
BDBM61379
Synonyms:
2-(4-Oxo-3-phenyl-3,4-dihydro-quinazolin-2-ylsulfanyl)-N-(tetrahydro-furan-2-ylmethyl)-acetamide 2-[(4-keto-3-phenyl-quinazolin-2-yl)thio]-N-(tetrahydrofurfuryl)acetamide N-(2-oxolanylmethyl)-2-[(4-oxo-3-phenyl-2-quinazolinyl)thio]acetamide SMR000612421 | cid_2947527
Type:
Small organic molecule
Emp. Form.:
C21H21N3O3S
Mol. Mass.:
395.475
SMILES:
O=C(CSc1nc2ccccc2c(=O)n1-c1ccccc1)NCC1CCCO1
: