Target
Polyadenylate-binding protein 1
Ligand
BDBM61380
Substrate
Meas. Tech.
uHTS fluorescence polarization assay for the identification of translation initiation inhibitors (PABP)
IC50
6205±n/a nM
Citation
 PubChem, PC uHTS fluorescence polarization assay for the identification of translation initiation inhibitors (PABP) PubChem Bioassay (2009)[AID] 
Target
Name:
Polyadenylate-binding protein 1
Synonyms:
PAB1 PABP1 PABPC1 poly(A) binding protein, cytoplasmic 1 | polyadenylate-binding protein 1
Type:
Enzyme Catalytic Domain
Mol. Mass.:
70694.26
Organism:
Homo sapiens (Human)
Description:
gi_46367787
Residue:
636
  
Inhibitor
Name:
BDBM61380
Synonyms:
MLS001034740 N-(4-ethylphenyl)-4-methyl-3-[4-morpholinyl(oxo)methyl]benzenesulfonamide SMR000670793 | cid_6462016
Type:
Small organic molecule
Emp. Form.:
C20H24N2O4S
Mol. Mass.:
388.481
SMILES:
CCc1ccc(NS(=O)(=O)c2ccc(C)c(c2)C(=O)N2CCOCC2)cc1
: