Target
Induced myeloid leukemia cell differentiation protein Mcl-1
Ligand
BDBM61896
Substrate
Meas. Tech.
Fluorescence polarization-based biochemical high throughput dose response assay for inhibitors of myeloid cell leukemia sequence 1 (MCL1) interactions with BIM-BH3 peptide.
IC50
23782±n/a nM
Citation
 PubChem, PC Fluorescence polarization-based biochemical high throughput dose response assay for inhibitors of myeloid cell leukemia sequence 1 (MCL1) interactions with BIM-BH3 peptide. PubChem Bioassay (2009)[AID] 
Target
Name:
Induced myeloid leukemia cell differentiation protein Mcl-1
Synonyms:
BCL2L3 Bcl-2-like protein 3 (Mcl-1) Bcl2-L-3 MCL1 Mcl-1 Myeloid cell leukemia sequence 1 (BCL2-related) | mcl1/EAT
Type:
Membrane; Single-pass membrane protein
Mol. Mass.:
37332.87
Organism:
Homo sapiens (Human)
Description:
Q07820
Residue:
350
  
Inhibitor
Name:
BDBM61896
Synonyms:
2-(3,4-dihydroxyphenyl)-4-benzo[h][1]benzopyranone 2-[3,4-bis(oxidanyl)phenyl]benzo[h]chromen-4-one MLS001360569 cid_676291
Type:
Small organic molecule
Emp. Form.:
C19H12O4
Mol. Mass.:
304.2962
SMILES:
Oc1ccc(cc1O)-c1cc(=O)c2ccc3ccccc3c2o1
: