Target
Regulator of G-protein signaling 8
Ligand
BDBM47735
Substrate
Meas. Tech.
Dose response, multiplexed high-throughput screen for small molecule regulators of RGS family protein interactions, specifically RGS8-Galphao for SAR Compounds
EC50
30000±n/a nM
Citation
 PubChem, PC Dose response, multiplexed high-throughput screen for small molecule regulators of RGS family protein interactions, specifically RGS8-Galphao for SAR Compounds PubChem Bioassay (2010)[AID] 
Target
Name:
Regulator of G-protein signaling 8
Synonyms:
RGS8 Regulator of G-protein signaling 8 (RGS8)
Type:
Enzyme Catalytic Domain
Mol. Mass.:
20925.80
Organism:
Homo sapiens (Human)
Description:
gi_74355113
Residue:
180
  
Inhibitor
Name:
BDBM47735
Synonyms:
3-chloranyl-N-(3,3-dimethylbutan-2-yl)-6-nitro-1-benzothiophene-2-carboxamide 3-chloro-6-nitro-N-(1,2,2-trimethylpropyl)benzothiophene-2-carboxamide MLS000583265 cid_2971539
Type:
Small organic molecule
Emp. Form.:
C15H17ClN2O3S
Mol. Mass.:
340.825
SMILES:
CC(NC(=O)c1sc2cc(ccc2c1Cl)[N+]([O-])=O)C(C)(C)C
: