Target
Heat shock factor protein 1
Ligand
BDBM62947
Substrate
Meas. Tech.
Luminescence Cell-Based Dose Confimation HTS to Identify Inhibitors of Heat Shock Factor 1 (HSF1)
EC50
<160±0 nM
Citation
 PubChem, PC Luminescence Cell-Based Dose Confimation HTS to Identify Inhibitors of Heat Shock Factor 1 (HSF1) PubChem Bioassay (2010)[AID] 
Target
Name:
Heat shock factor protein 1
Synonyms:
HSF1_MOUSE Hsf1 protein
Type:
Enzyme Catalytic Domain
Mol. Mass.:
57208.68
Organism:
Mus musculus
Description:
P38532
Residue:
525
  
Inhibitor
Name:
BDBM62947
Synonyms:
MLS000539987 N,N-dimethylthiocarbamic acid O-[4-[2-[(4-fluorophenyl)thio]acetyl]-2,6-dimethyl-phenyl] ester O-[4-[2-(4-fluorophenyl)sulfanylacetyl]-2,6-dimethylphenyl] N,N-dimethylcarbamothioate SMR000125445 | cid_1486505
Type:
Small organic molecule
Emp. Form.:
C19H20FNO2S2
Mol. Mass.:
377.496
SMILES:
CN(C)C(=S)Oc1c(C)cc(cc1C)C(=O)CSc1ccc(F)cc1
: