Target
Heat shock factor protein 1
Ligand
BDBM63168
Substrate
Meas. Tech.
Luminescence Cell-Based Dose Confimation HTS to Identify Inhibitors of Heat Shock Factor 1 (HSF1)
EC50
>195000±0 nM
Citation
 PubChem, PC Luminescence Cell-Based Dose Confimation HTS to Identify Inhibitors of Heat Shock Factor 1 (HSF1) PubChem Bioassay (2010)[AID] 
Target
Name:
Heat shock factor protein 1
Synonyms:
HSF1_MOUSE Hsf1 protein
Type:
Enzyme Catalytic Domain
Mol. Mass.:
57208.68
Organism:
Mus musculus
Description:
P38532
Residue:
525
  
Inhibitor
Name:
BDBM63168
Synonyms:
4-methyl-2-[[(Z)-(2-oxidanylidenenaphthalen-1-ylidene)methyl]amino]-5-(phenylmethyl)thiophene-3-carboxamide 5-Benzyl-2-[(2-hydroxy-naphthalen-1-ylmethylene)-amino]-4-methyl-thiophene-3-carboxylic acid amide 5-benzyl-4-methyl-2-[[(Z)-(2-oxonaphthalen-1-ylidene)methyl]amino]thiophene-3-carboxamide SMR000171736 | cid_5432072
Type:
Small organic molecule
Emp. Form.:
C24H20N2O2S
Mol. Mass.:
400.493
SMILES:
Cc1c(Cc2ccccc2)sc(N=Cc2c(O)ccc3ccccc23)c1C(N)=O
: